{"text_format":"1","workbook":"xlsx","n_sheets":8,"sheets":["School Info","Invoices","Facility Expenditure Report","Expenditure Overview","Eligible Costs","All schools","Instructions","FAQ"],"not_rendered":{"charts":0,"images":13,"macros":1,"external_links":0,"defined_names":12,"comments":0,"pivot_tables":0},"unopened":[],"bounds":{"document_bytes":16777216,"sheet_cells":100000,"rows_first":2000,"rows_last":500,"rows_between":2000,"halvings":0,"cell_chars":16384,"cell_head_chars":4096},"cells_cut":0,"cells_raw":0,"read":"whole","date_system":"1900"}

{"sheet":"School Info","index":0,"n_rows":33,"n_cols":12,"rows_kept":33,"cut":false,"hidden":false,"merged":[[26,5,26,10],[32,5,32,10],[17,5,17,10],[4,5,4,10],[5,5,5,10],[9,5,9,10],[11,5,11,10],[7,5,7,10],[13,5,13,10],[14,5,14,10],[15,5,15,10],[16,5,16,10],[20,5,20,10],[21,5,21,10],[22,5,22,10],[19,5,19,10],[27,5,27,10],[28,5,28,10],[29,5,29,10],[30,5,30,10],[31,5,31,10],[1,1,1,2],[2,1,2,2],[23,5,23,10],[24,5,24,10],[25,5,25,10],[18,5,18,10]]}
[]
[null,"CSFA Invoice Template Wizard"]
[null,"Filll in all applicable fields starting with CDS Code"]
[null,"STEP 1 → ","County-District-School (CDS) Code:",null,null,null,"-",null,"-",null,null,{"$f":"VALUE(F4&H4&J4)","v":{"$error":"#VALUE!"}}]
[null,null,"Charter School Name:",null,null,{"$f":"L5","v":""},null,null,null,null,null,{"$f":"IFERROR(VLOOKUP($L$4,'All schools'!A:C,2,FALSE),\"\")","v":""}]
[null,null,"Charter School Number",null,null,{"$f":"L6","v":""},null,null,null,null,null,{"$f":"IFERROR(VLOOKUP($L$4,'All schools'!A:C,3,FALSE),\"\")","v":""}]
[]
[null,null,"Contact Person Name:"]
[]
[null,null,"Phone Number:"]
[]
[null,null,"E-mail Address:"]
[]
[null,null,"Address of Facility(ies) claiming additional costs","Facility 1","F1"]
[null,null,null,"Facility 2","F2"]
{"$rows_left_out":19}
{"sheet":"Invoices","index":1,"n_rows":105,"n_cols":16,"rows_kept":105,"cut":false,"hidden":false,"merged":[[3,13,104,13],[0,1,1,4],[2,1,2,3]]}
[null,{"$f":"'Facility Expenditure Report'!F8","v":""}]
[null,null,null,null,null,null,null,null,null,null,null,null,null,null,"2014-07-01"]
[null,"Invoices 14-15 True Up",null,null,null,null,null,null,null,null,null,null,null,null,"2015-06-30"]
[null,"PDF Page(s)","Invoice #","Invoice Date","Vendor","Facility\n(Drop-down)","Project Description","Project Type\n(Drop-down)",null,"Requested Costs","Eligible Amount","Comments/ Further Project Description",null,"            AUTHORITY USE ONLY                         AUTHORITY USE ONLY                          AUTHORITY USE ONLY                          AUTHORITY USE ONLY                          AUTHORITY USE ONLY                                   AUTHORITY USE ONLY                                        AUTHORITY USE ONLY                                         AUTHORITY USE ONLY                                                      AUTHORITY USE ONLY                                  AUTHORITY USE ONLY","Eligible Cost Cost (Y/N)","Authority Comments"]
[1,null,null,null,null,null,null,null,{"$f":"INDEX(Costz,M5)","v":0},null,{"$f":"IF(OR(H5=\"Ineligible Costs\",O5=\"N\",O5=\"No\"),0,IF(AND(D5>=$O$2,D5<=$O$3),J5,0))","v":0},null,1]
[2,null,null,null,null,null,null,null,{"$f":"TEXT(H6,)","v":""},null,{"$f":"IF(OR(H6=\"Ineligible Costs\",O6=\"N\",O6=\"No\"),0,IF(AND(D6>=$O$2,D6<=$O$3),J6,0))","v":0}]
[3,null,null,null,null,null,null,null,{"$f":"TEXT(H7,)","v":""},null,0]
[4,null,null,null,null,null,null,null,"",null,0]
[5,null,null,null,null,null,null,null,"",null,0]
[6,null,null,null,null,null,null,null,"",null,0]
[7,null,null,null,null,null,null,null,"",null,0]
[8,null,null,null,null,null,null,null,"",null,0]
[9,null,null,null,null,null,null,null,"",null,0]
[10,null,null,null,null,null,null,null,"",null,0]
[11,null,null,null,null,null,null,null,"",null,0]
{"$rows_left_out":91}
{"sheet":"Facility Expenditure Report","index":2,"n_rows":52,"n_cols":13,"rows_kept":52,"cut":false,"hidden":false,"merged":[[11,11,15,13],[10,10,10,11],[38,1,38,7],[39,1,39,7],[40,1,40,7],[41,1,41,7],[43,1,43,7],[14,1,14,5],[15,0,15,8],[37,0,37,8],[16,1,16,7],[19,2,19,5],[20,2,20,5],[21,2,21,5],[22,2,22,5],[23,2,23,5],[26,0,26,8],[27,1,27,7],[32,1,32,5],[34,1,34,5],[35,1,35,5],[8,1,8,4],[8,5,8,7],[9,1,9,4],[9,5,9,7],[12,5,12,7],[10,1,10,4],[10,5,10,7],[11,1,11,2],[11,5,11,7],[3,0,3,8],[4,1,4,7],[5,1,5,7],[6,0,6,8],[7,1,7,4],[7,5,7,7]]}
[null,null,null,null,null,null,null,null,null,"    Complete All Steps to Submit Invoices"]
["California School Finance Authority",null,null,null,null,null,null,null,null,"STEP 1"]
["Revised February 2015"]
["Charter School Facility Grant Program\n2014–15 Facility Invoice Expenditure Report",null,null,null,null,null,null,null,null,"STEP 2"]
[null,"To request final reimbursement for additional fiscal year 2014–15 facility expenditures",null,null,null,null,null,null,null," Click here→"]
[null,"(Education Code Section 47614.5)"]
["SECTION 1.  CHARTER SCHOOL INFORMATION:",null,null,null,null,null,null,null,null,"STEP 3"]
[null,"Charter School Name:",null,null,null,{"$f":"'School Info'!F5","v":""},null,null,null," Click here→"]
[null,"County-District-School (CDS) Code:",null,null,null,{"$f":"IFERROR('School Info'!L4,\"\")","v":""}]
[null,"Charter School Number:",null,null,null,{"$f":"'School Info'!F6","v":""},null,null,null,null,"If the above button doesn't work, simply email this excel file to"]
[null,"Contact Person Name/Title:",null,null,null,{"$f":"'School Info'!F8","v":0},null,null,null,null,"CSFA@treasurer.ca.gov",null,"with the following Attachments:"]
[null,"Phone Number:",null,null,null,{"$f":"'School Info'!F10","v":0},null,null,null,null,null,{"$f":"\"-Signed Signature page\n-Supporting Invoices, receipts, Contracts, and work orders\"","v":"-Signed Signature page\n-Supporting Invoices, receipts, Contracts, and work orders"}]
[null,"E-mail Address:",null,null,null,{"$f":"'School Info'!F12","v":0}]
[]
[]
{"$rows_left_out":38}
{"sheet":"Expenditure Overview","index":3,"n_rows":109,"n_cols":20,"rows_kept":109,"cut":false,"hidden":false,"merged":[]}
[{"$f":"'Facility Expenditure Report'!F8","v":""}]
["14-15 SB 740 Eligible Expenses "]
[]
[null,null,{"$f":"COUNTIF(Invoices!$I:$I,C5)","v":0},null,null,null,{"$f":"COUNTIF(Invoices!$I:$I,G5)","v":0},null,null,null,{"$f":"COUNTIF(Invoices!$I:$I,K5)","v":0},null,null,null,{"$f":"COUNTIF(Invoices!$I:$I,O5)","v":0},null,null,null,{"$f":"COUNTIF(Invoices!$I:$I,S5)","v":0}]
[null,"Invoice # ",{"$f":"'Eligible Costs'!A2","v":"Remodeling"},"Amounts",null,"Invoice # ",{"$f":"'Eligible Costs'!A3","v":"Deferred Maintenance"},"Amounts",null,"Invoice # ",{"$f":"'Eligible Costs'!A4","v":"Installation"},"Amounts",null,"Invoice # ",{"$f":"'Eligible Costs'!A5","v":"Materials"},"Amounts",null,"Invoice # ",{"$f":"'Eligible Costs'!A6","v":"Maintaining/Repairing Common Areas"},"Amounts"]
[null,{"$f":"IF(ROWS(B$6:B6)<=C$4,INDEX(Invoices!$C$5:$C$104,SMALL(IF(Invoices!$I$5:$I$104=C$5,ROW(Invoices!$C$5:$C$104)-ROW(Invoices!$C$5)+1),ROWS(B$6:B6))),\"\")","v":""},{"$f":"IFERROR(VLOOKUP(B6,Invoices!$C:$L,5,FALSE),\"\")","v":""},{"$f":"IFERROR(VLOOKUP(B6,Invoices!$C:$L,9,FALSE),\"\")","v":""},null,{"$f":"IF(ROWS(F$6:F6)<=G$4,INDEX(Invoices!$C$5:$C$104,SMALL(IF(Invoices!$I$5:$I$104=G$5,ROW(Invoices!$C$5:$C$104)-ROW(Invoices!$C$5)+1),ROWS(F$6:F6))),\"\")","v":""},{"$f":"IFERROR(VLOOKUP(F6,Invoices!$C:$L,5,FALSE),\"\")","v":""},{"$f":"IFERROR(VLOOKUP(F6,Invoices!$C:$L,9,FALSE),\"\")","v":""},null,{"$f":"IF(ROWS(J$6:J6)<=K$4,INDEX(Invoices!$C$5:$C$104,SMALL(IF(Invoices!$I$5:$I$104=K$5,ROW(Invoices!$C$5:$C$104)-ROW(Invoices!$C$5)+1),ROWS(J$6:J6))),\"\")","v":""},{"$f":"IFERROR(VLOOKUP(J6,Invoices!$C:$L,5,FALSE),\"\")","v":""},{"$f":"IFERROR(VLOOKUP(J6,Invoices!$C:$L,9,FALSE),\"\")","v":""},null,{"$f":"IF(ROWS(N$6:N6)<=O$4,INDEX(Invoices!$C$5:$C$104,SMALL(IF(Invoices!$I$5:$I$104=O$5,ROW(Invoices!$C$5:$C$104)-ROW(Invoices!$C$5)+1),ROWS(N$6:N6))),\"\")","v":""},{"$f":"IFERROR(VLOOKUP(N6,Invoices!$C:$L,5,FALSE),\"\")","v":""},{"$f":"IFERROR(VLOOKUP(N6,Invoices!$C:$L,9,FALSE),\"\")","v":""},null,{"$f":"IF(ROWS(R$6:R6)<=S$4,INDEX(Invoices!$C$5:$C$104,SMALL(IF(Invoices!$I$5:$I$104=S$5,ROW(Invoices!$C$5:$C$104)-ROW(Invoices!$C$5)+1),ROWS(R$6:R6))),\"\")","v":""},{"$f":"IFERROR(VLOOKUP(R6,Invoices!$C:$L,5,FALSE),\"\")","v":""},{"$f":"IFERROR(VLOOKUP(R6,Invoices!$C:$L,9,FALSE),\"\")","v":""}]
[null,{"$f":"IF(ROWS(B$6:B7)<=C$4,INDEX(Invoices!$C$5:$C$104,SMALL(IF(Invoices!$I$5:$I$104=C$5,ROW(Invoices!$C$5:$C$104)-ROW(Invoices!$C$5)+1),ROWS(B$6:B7))),\"\")","v":""},{"$f":"IFERROR(VLOOKUP(B7,Invoices!$C:$L,5,FALSE),\"\")","v":""},{"$f":"IFERROR(VLOOKUP(B7,Invoices!$C:$L,9,FALSE),\"\")","v":""},null,{"$f":"IF(ROWS(F$6:F7)<=G$4,INDEX(Invoices!$C$5:$C$104,SMALL(IF(Invoices!$I$5:$I$104=G$5,ROW(Invoices!$C$5:$C$104)-ROW(Invoices!$C$5)+1),ROWS(F$6:F7))),\"\")","v":""},{"$f":"IFERROR(VLOOKUP(F7,Invoices!$C:$L,5,FALSE),\"\")","v":""},{"$f":"IFERROR(VLOOKUP(F7,Invoices!$C:$L,9,FALSE),\"\")","v":""},null,{"$f":"IF(ROWS(J$6:J7)<=K$4,INDEX(Invoices!$C$5:$C$104,SMALL(IF(Invoices!$I$5:$I$104=K$5,ROW(Invoices!$C$5:$C$104)-ROW(Invoices!$C$5)+1),ROWS(J$6:J7))),\"\")","v":""},{"$f":"IFERROR(VLOOKUP(J7,Invoices!$C:$L,5,FALSE),\"\")","v":""},{"$f":"IFERROR(VLOOKUP(J7,Invoices!$C:$L,9,FALSE),\"\")","v":""},null,{"$f":"IF(ROWS(N$6:N7)<=O$4,INDEX(Invoices!$C$5:$C$104,SMALL(IF(Invoices!$I$5:$I$104=O$5,ROW(Invoices!$C$5:$C$104)-ROW(Invoices!$C$5)+1),ROWS(N$6:N7))),\"\")","v":""},{"$f":"IFERROR(VLOOKUP(N7,Invoices!$C:$L,5,FALSE),\"\")","v":""},{"$f":"IFERROR(VLOOKUP(N7,Invoices!$C:$L,9,FALSE),\"\")","v":""},null,{"$f":"IF(ROWS(R$6:R7)<=S$4,INDEX(Invoices!$C$5:$C$104,SMALL(IF(Invoices!$I$5:$I$104=S$5,ROW(Invoices!$C$5:$C$104)-ROW(Invoices!$C$5)+1),ROWS(R$6:R7))),\"\")","v":""},{"$f":"IFERROR(VLOOKUP(R7,Invoices!$C:$L,5,FALSE),\"\")","v":""},{"$f":"IFERROR(VLOOKUP(R7,Invoices!$C:$L,9,FALSE),\"\")","v":""}]
[null,{"$f":"IF(ROWS(B$6:B8)<=C$4,INDEX(Invoices!$C$5:$C$104,SMALL(IF(Invoices!$I$5:$I$104=C$5,ROW(Invoices!$C$5:$C$104)-ROW(Invoices!$C$5)+1),ROWS(B$6:B8))),\"\")","v":""},{"$f":"IFERROR(VLOOKUP(B8,Invoices!$C:$L,5,FALSE),\"\")","v":""},{"$f":"IFERROR(VLOOKUP(B8,Invoices!$C:$L,9,FALSE),\"\")","v":""},null,{"$f":"IF(ROWS(F$6:F8)<=G$4,INDEX(Invoices!$C$5:$C$104,SMALL(IF(Invoices!$I$5:$I$104=G$5,ROW(Invoices!$C$5:$C$104)-ROW(Invoices!$C$5)+1),ROWS(F$6:F8))),\"\")","v":""},{"$f":"IFERROR(VLOOKUP(F8,Invoices!$C:$L,5,FALSE),\"\")","v":""},{"$f":"IFERROR(VLOOKUP(F8,Invoices!$C:$L,9,FALSE),\"\")","v":""},null,{"$f":"IF(ROWS(J$6:J8)<=K$4,INDEX(Invoices!$C$5:$C$104,SMALL(IF(Invoices!$I$5:$I$104=K$5,ROW(Invoices!$C$5:$C$104)-ROW(Invoices!$C$5)+1),ROWS(J$6:J8))),\"\")","v":""},{"$f":"IFERROR(VLOOKUP(J8,Invoices!$C:$L,5,FALSE),\"\")","v":""},{"$f":"IFERROR(VLOOKUP(J8,Invoices!$C:$L,9,FALSE),\"\")","v":""},null,{"$f":"IF(ROWS(N$6:N8)<=O$4,INDEX(Invoices!$C$5:$C$104,SMALL(IF(Invoices!$I$5:$I$104=O$5,ROW(Invoices!$C$5:$C$104)-ROW(Invoices!$C$5)+1),ROWS(N$6:N8))),\"\")","v":""},{"$f":"IFERROR(VLOOKUP(N8,Invoices!$C:$L,5,FALSE),\"\")","v":""},{"$f":"IFERROR(VLOOKUP(N8,Invoices!$C:$L,9,FALSE),\"\")","v":""},null,{"$f":"IF(ROWS(R$6:R8)<=S$4,INDEX(Invoices!$C$5:$C$104,SMALL(IF(Invoices!$I$5:$I$104=S$5,ROW(Invoices!$C$5:$C$104)-ROW(Invoices!$C$5)+1),ROWS(R$6:R8))),\"\")","v":""},{"$f":"IFERROR(VLOOKUP(R8,Invoices!$C:$L,5,FALSE),\"\")","v":""},{"$f":"IFERROR(VLOOKUP(R8,Invoices!$C:$L,9,FALSE),\"\")","v":""}]
[null,{"$f":"IF(ROWS(B$6:B9)<=C$4,INDEX(Invoices!$C$5:$C$104,SMALL(IF(Invoices!$I$5:$I$104=C$5,ROW(Invoices!$C$5:$C$104)-ROW(Invoices!$C$5)+1),ROWS(B$6:B9))),\"\")","v":""},{"$f":"IFERROR(VLOOKUP(B9,Invoices!$C:$L,5,FALSE),\"\")","v":""},{"$f":"IFERROR(VLOOKUP(B9,Invoices!$C:$L,9,FALSE),\"\")","v":""},null,{"$f":"IF(ROWS(F$6:F9)<=G$4,INDEX(Invoices!$C$5:$C$104,SMALL(IF(Invoices!$I$5:$I$104=G$5,ROW(Invoices!$C$5:$C$104)-ROW(Invoices!$C$5)+1),ROWS(F$6:F9))),\"\")","v":""},{"$f":"IFERROR(VLOOKUP(F9,Invoices!$C:$L,5,FALSE),\"\")","v":""},{"$f":"IFERROR(VLOOKUP(F9,Invoices!$C:$L,9,FALSE),\"\")","v":""},null,{"$f":"IF(ROWS(J$6:J9)<=K$4,INDEX(Invoices!$C$5:$C$104,SMALL(IF(Invoices!$I$5:$I$104=K$5,ROW(Invoices!$C$5:$C$104)-ROW(Invoices!$C$5)+1),ROWS(J$6:J9))),\"\")","v":""},{"$f":"IFERROR(VLOOKUP(J9,Invoices!$C:$L,5,FALSE),\"\")","v":""},{"$f":"IFERROR(VLOOKUP(J9,Invoices!$C:$L,9,FALSE),\"\")","v":""},null,{"$f":"IF(ROWS(N$6:N9)<=O$4,INDEX(Invoices!$C$5:$C$104,SMALL(IF(Invoices!$I$5:$I$104=O$5,ROW(Invoices!$C$5:$C$104)-ROW(Invoices!$C$5)+1),ROWS(N$6:N9))),\"\")","v":""},{"$f":"IFERROR(VLOOKUP(N9,Invoices!$C:$L,5,FALSE),\"\")","v":""},{"$f":"IFERROR(VLOOKUP(N9,Invoices!$C:$L,9,FALSE),\"\")","v":""},null,{"$f":"IF(ROWS(R$6:R9)<=S$4,INDEX(Invoices!$C$5:$C$104,SMALL(IF(Invoices!$I$5:$I$104=S$5,ROW(Invoices!$C$5:$C$104)-ROW(Invoices!$C$5)+1),ROWS(R$6:R9))),\"\")","v":""},{"$f":"IFERROR(VLOOKUP(R9,Invoices!$C:$L,5,FALSE),\"\")","v":""},{"$f":"IFERROR(VLOOKUP(R9,Invoices!$C:$L,9,FALSE),\"\")","v":""}]
[null,{"$f":"IF(ROWS(B$6:B10)<=C$4,INDEX(Invoices!$C$5:$C$104,SMALL(IF(Invoices!$I$5:$I$104=C$5,ROW(Invoices!$C$5:$C$104)-ROW(Invoices!$C$5)+1),ROWS(B$6:B10))),\"\")","v":""},{"$f":"IFERROR(VLOOKUP(B10,Invoices!$C:$L,5,FALSE),\"\")","v":""},{"$f":"IFERROR(VLOOKUP(B10,Invoices!$C:$L,9,FALSE),\"\")","v":""},null,{"$f":"IF(ROWS(F$6:F10)<=G$4,INDEX(Invoices!$C$5:$C$104,SMALL(IF(Invoices!$I$5:$I$104=G$5,ROW(Invoices!$C$5:$C$104)-ROW(Invoices!$C$5)+1),ROWS(F$6:F10))),\"\")","v":""},{"$f":"IFERROR(VLOOKUP(F10,Invoices!$C:$L,5,FALSE),\"\")","v":""},{"$f":"IFERROR(VLOOKUP(F10,Invoices!$C:$L,9,FALSE),\"\")","v":""},null,{"$f":"IF(ROWS(J$6:J10)<=K$4,INDEX(Invoices!$C$5:$C$104,SMALL(IF(Invoices!$I$5:$I$104=K$5,ROW(Invoices!$C$5:$C$104)-ROW(Invoices!$C$5)+1),ROWS(J$6:J10))),\"\")","v":""},{"$f":"IFERROR(VLOOKUP(J10,Invoices!$C:$L,5,FALSE),\"\")","v":""},{"$f":"IFERROR(VLOOKUP(J10,Invoices!$C:$L,9,FALSE),\"\")","v":""},null,{"$f":"IF(ROWS(N$6:N10)<=O$4,INDEX(Invoices!$C$5:$C$104,SMALL(IF(Invoices!$I$5:$I$104=O$5,ROW(Invoices!$C$5:$C$104)-ROW(Invoices!$C$5)+1),ROWS(N$6:N10))),\"\")","v":""},{"$f":"IFERROR(VLOOKUP(N10,Invoices!$C:$L,5,FALSE),\"\")","v":""},{"$f":"IFERROR(VLOOKUP(N10,Invoices!$C:$L,9,FALSE),\"\")","v":""},null,{"$f":"IF(ROWS(R$6:R10)<=S$4,INDEX(Invoices!$C$5:$C$104,SMALL(IF(Invoices!$I$5:$I$104=S$5,ROW(Invoices!$C$5:$C$104)-ROW(Invoices!$C$5)+1),ROWS(R$6:R10))),\"\")","v":""},{"$f":"IFERROR(VLOOKUP(R10,Invoices!$C:$L,5,FALSE),\"\")","v":""},{"$f":"IFERROR(VLOOKUP(R10,Invoices!$C:$L,9,FALSE),\"\")","v":""}]
[null,{"$f":"IF(ROWS(B$6:B11)<=C$4,INDEX(Invoices!$C$5:$C$104,SMALL(IF(Invoices!$I$5:$I$104=C$5,ROW(Invoices!$C$5:$C$104)-ROW(Invoices!$C$5)+1),ROWS(B$6:B11))),\"\")","v":""},{"$f":"IFERROR(VLOOKUP(B11,Invoices!$C:$L,5,FALSE),\"\")","v":""},{"$f":"IFERROR(VLOOKUP(B11,Invoices!$C:$L,9,FALSE),\"\")","v":""},null,{"$f":"IF(ROWS(F$6:F11)<=G$4,INDEX(Invoices!$C$5:$C$104,SMALL(IF(Invoices!$I$5:$I$104=G$5,ROW(Invoices!$C$5:$C$104)-ROW(Invoices!$C$5)+1),ROWS(F$6:F11))),\"\")","v":""},{"$f":"IFERROR(VLOOKUP(F11,Invoices!$C:$L,5,FALSE),\"\")","v":""},{"$f":"IFERROR(VLOOKUP(F11,Invoices!$C:$L,9,FALSE),\"\")","v":""},null,{"$f":"IF(ROWS(J$6:J11)<=K$4,INDEX(Invoices!$C$5:$C$104,SMALL(IF(Invoices!$I$5:$I$104=K$5,ROW(Invoices!$C$5:$C$104)-ROW(Invoices!$C$5)+1),ROWS(J$6:J11))),\"\")","v":""},{"$f":"IFERROR(VLOOKUP(J11,Invoices!$C:$L,5,FALSE),\"\")","v":""},{"$f":"IFERROR(VLOOKUP(J11,Invoices!$C:$L,9,FALSE),\"\")","v":""},null,{"$f":"IF(ROWS(N$6:N11)<=O$4,INDEX(Invoices!$C$5:$C$104,SMALL(IF(Invoices!$I$5:$I$104=O$5,ROW(Invoices!$C$5:$C$104)-ROW(Invoices!$C$5)+1),ROWS(N$6:N11))),\"\")","v":""},{"$f":"IFERROR(VLOOKUP(N11,Invoices!$C:$L,5,FALSE),\"\")","v":""},{"$f":"IFERROR(VLOOKUP(N11,Invoices!$C:$L,9,FALSE),\"\")","v":""},null,{"$f":"IF(ROWS(R$6:R11)<=S$4,INDEX(Invoices!$C$5:$C$104,SMALL(IF(Invoices!$I$5:$I$104=S$5,ROW(Invoices!$C$5:$C$104)-ROW(Invoices!$C$5)+1),ROWS(R$6:R11))),\"\")","v":""},{"$f":"IFERROR(VLOOKUP(R11,Invoices!$C:$L,5,FALSE),\"\")","v":""},{"$f":"IFERROR(VLOOKUP(R11,Invoices!$C:$L,9,FALSE),\"\")","v":""}]
[null,{"$f":"IF(ROWS(B$6:B12)<=C$4,INDEX(Invoices!$C$5:$C$104,SMALL(IF(Invoices!$I$5:$I$104=C$5,ROW(Invoices!$C$5:$C$104)-ROW(Invoices!$C$5)+1),ROWS(B$6:B12))),\"\")","v":""},{"$f":"IFERROR(VLOOKUP(B12,Invoices!$C:$L,5,FALSE),\"\")","v":""},{"$f":"IFERROR(VLOOKUP(B12,Invoices!$C:$L,9,FALSE),\"\")","v":""},null,{"$f":"IF(ROWS(F$6:F12)<=G$4,INDEX(Invoices!$C$5:$C$104,SMALL(IF(Invoices!$I$5:$I$104=G$5,ROW(Invoices!$C$5:$C$104)-ROW(Invoices!$C$5)+1),ROWS(F$6:F12))),\"\")","v":""},{"$f":"IFERROR(VLOOKUP(F12,Invoices!$C:$L,5,FALSE),\"\")","v":""},{"$f":"IFERROR(VLOOKUP(F12,Invoices!$C:$L,9,FALSE),\"\")","v":""},null,{"$f":"IF(ROWS(J$6:J12)<=K$4,INDEX(Invoices!$C$5:$C$104,SMALL(IF(Invoices!$I$5:$I$104=K$5,ROW(Invoices!$C$5:$C$104)-ROW(Invoices!$C$5)+1),ROWS(J$6:J12))),\"\")","v":""},{"$f":"IFERROR(VLOOKUP(J12,Invoices!$C:$L,5,FALSE),\"\")","v":""},{"$f":"IFERROR(VLOOKUP(J12,Invoices!$C:$L,9,FALSE),\"\")","v":""},null,{"$f":"IF(ROWS(N$6:N12)<=O$4,INDEX(Invoices!$C$5:$C$104,SMALL(IF(Invoices!$I$5:$I$104=O$5,ROW(Invoices!$C$5:$C$104)-ROW(Invoices!$C$5)+1),ROWS(N$6:N12))),\"\")","v":""},{"$f":"IFERROR(VLOOKUP(N12,Invoices!$C:$L,5,FALSE),\"\")","v":""},{"$f":"IFERROR(VLOOKUP(N12,Invoices!$C:$L,9,FALSE),\"\")","v":""},null,{"$f":"IF(ROWS(R$6:R12)<=S$4,INDEX(Invoices!$C$5:$C$104,SMALL(IF(Invoices!$I$5:$I$104=S$5,ROW(Invoices!$C$5:$C$104)-ROW(Invoices!$C$5)+1),ROWS(R$6:R12))),\"\")","v":""},{"$f":"IFERROR(VLOOKUP(R12,Invoices!$C:$L,5,FALSE),\"\")","v":""},{"$f":"IFERROR(VLOOKUP(R12,Invoices!$C:$L,9,FALSE),\"\")","v":""}]
[null,{"$f":"IF(ROWS(B$6:B13)<=C$4,INDEX(Invoices!$C$5:$C$104,SMALL(IF(Invoices!$I$5:$I$104=C$5,ROW(Invoices!$C$5:$C$104)-ROW(Invoices!$C$5)+1),ROWS(B$6:B13))),\"\")","v":""},{"$f":"IFERROR(VLOOKUP(B13,Invoices!$C:$L,5,FALSE),\"\")","v":""},{"$f":"IFERROR(VLOOKUP(B13,Invoices!$C:$L,9,FALSE),\"\")","v":""},null,{"$f":"IF(ROWS(F$6:F13)<=G$4,INDEX(Invoices!$C$5:$C$104,SMALL(IF(Invoices!$I$5:$I$104=G$5,ROW(Invoices!$C$5:$C$104)-ROW(Invoices!$C$5)+1),ROWS(F$6:F13))),\"\")","v":""},{"$f":"IFERROR(VLOOKUP(F13,Invoices!$C:$L,5,FALSE),\"\")","v":""},{"$f":"IFERROR(VLOOKUP(F13,Invoices!$C:$L,9,FALSE),\"\")","v":""},null,{"$f":"IF(ROWS(J$6:J13)<=K$4,INDEX(Invoices!$C$5:$C$104,SMALL(IF(Invoices!$I$5:$I$104=K$5,ROW(Invoices!$C$5:$C$104)-ROW(Invoices!$C$5)+1),ROWS(J$6:J13))),\"\")","v":""},{"$f":"IFERROR(VLOOKUP(J13,Invoices!$C:$L,5,FALSE),\"\")","v":""},{"$f":"IFERROR(VLOOKUP(J13,Invoices!$C:$L,9,FALSE),\"\")","v":""},null,{"$f":"IF(ROWS(N$6:N13)<=O$4,INDEX(Invoices!$C$5:$C$104,SMALL(IF(Invoices!$I$5:$I$104=O$5,ROW(Invoices!$C$5:$C$104)-ROW(Invoices!$C$5)+1),ROWS(N$6:N13))),\"\")","v":""},{"$f":"IFERROR(VLOOKUP(N13,Invoices!$C:$L,5,FALSE),\"\")","v":""},{"$f":"IFERROR(VLOOKUP(N13,Invoices!$C:$L,9,FALSE),\"\")","v":""},null,{"$f":"IF(ROWS(R$6:R13)<=S$4,INDEX(Invoices!$C$5:$C$104,SMALL(IF(Invoices!$I$5:$I$104=S$5,ROW(Invoices!$C$5:$C$104)-ROW(Invoices!$C$5)+1),ROWS(R$6:R13))),\"\")","v":""},{"$f":"IFERROR(VLOOKUP(R13,Invoices!$C:$L,5,FALSE),\"\")","v":""},{"$f":"IFERROR(VLOOKUP(R13,Invoices!$C:$L,9,FALSE),\"\")","v":""}]
[null,{"$f":"IF(ROWS(B$6:B14)<=C$4,INDEX(Invoices!$C$5:$C$104,SMALL(IF(Invoices!$I$5:$I$104=C$5,ROW(Invoices!$C$5:$C$104)-ROW(Invoices!$C$5)+1),ROWS(B$6:B14))),\"\")","v":""},{"$f":"IFERROR(VLOOKUP(B14,Invoices!$C:$L,5,FALSE),\"\")","v":""},{"$f":"IFERROR(VLOOKUP(B14,Invoices!$C:$L,9,FALSE),\"\")","v":""},null,{"$f":"IF(ROWS(F$6:F14)<=G$4,INDEX(Invoices!$C$5:$C$104,SMALL(IF(Invoices!$I$5:$I$104=G$5,ROW(Invoices!$C$5:$C$104)-ROW(Invoices!$C$5)+1),ROWS(F$6:F14))),\"\")","v":""},{"$f":"IFERROR(VLOOKUP(F14,Invoices!$C:$L,5,FALSE),\"\")","v":""},{"$f":"IFERROR(VLOOKUP(F14,Invoices!$C:$L,9,FALSE),\"\")","v":""},null,{"$f":"IF(ROWS(J$6:J14)<=K$4,INDEX(Invoices!$C$5:$C$104,SMALL(IF(Invoices!$I$5:$I$104=K$5,ROW(Invoices!$C$5:$C$104)-ROW(Invoices!$C$5)+1),ROWS(J$6:J14))),\"\")","v":""},{"$f":"IFERROR(VLOOKUP(J14,Invoices!$C:$L,5,FALSE),\"\")","v":""},{"$f":"IFERROR(VLOOKUP(J14,Invoices!$C:$L,9,FALSE),\"\")","v":""},null,{"$f":"IF(ROWS(N$6:N14)<=O$4,INDEX(Invoices!$C$5:$C$104,SMALL(IF(Invoices!$I$5:$I$104=O$5,ROW(Invoices!$C$5:$C$104)-ROW(Invoices!$C$5)+1),ROWS(N$6:N14))),\"\")","v":""},{"$f":"IFERROR(VLOOKUP(N14,Invoices!$C:$L,5,FALSE),\"\")","v":""},{"$f":"IFERROR(VLOOKUP(N14,Invoices!$C:$L,9,FALSE),\"\")","v":""},null,{"$f":"IF(ROWS(R$6:R14)<=S$4,INDEX(Invoices!$C$5:$C$104,SMALL(IF(Invoices!$I$5:$I$104=S$5,ROW(Invoices!$C$5:$C$104)-ROW(Invoices!$C$5)+1),ROWS(R$6:R14))),\"\")","v":""},{"$f":"IFERROR(VLOOKUP(R14,Invoices!$C:$L,5,FALSE),\"\")","v":""},{"$f":"IFERROR(VLOOKUP(R14,Invoices!$C:$L,9,FALSE),\"\")","v":""}]
[null,{"$f":"IF(ROWS(B$6:B15)<=C$4,INDEX(Invoices!$C$5:$C$104,SMALL(IF(Invoices!$I$5:$I$104=C$5,ROW(Invoices!$C$5:$C$104)-ROW(Invoices!$C$5)+1),ROWS(B$6:B15))),\"\")","v":""},{"$f":"IFERROR(VLOOKUP(B15,Invoices!$C:$L,5,FALSE),\"\")","v":""},{"$f":"IFERROR(VLOOKUP(B15,Invoices!$C:$L,9,FALSE),\"\")","v":""},null,{"$f":"IF(ROWS(F$6:F15)<=G$4,INDEX(Invoices!$C$5:$C$104,SMALL(IF(Invoices!$I$5:$I$104=G$5,ROW(Invoices!$C$5:$C$104)-ROW(Invoices!$C$5)+1),ROWS(F$6:F15))),\"\")","v":""},{"$f":"IFERROR(VLOOKUP(F15,Invoices!$C:$L,5,FALSE),\"\")","v":""},{"$f":"IFERROR(VLOOKUP(F15,Invoices!$C:$L,9,FALSE),\"\")","v":""},null,{"$f":"IF(ROWS(J$6:J15)<=K$4,INDEX(Invoices!$C$5:$C$104,SMALL(IF(Invoices!$I$5:$I$104=K$5,ROW(Invoices!$C$5:$C$104)-ROW(Invoices!$C$5)+1),ROWS(J$6:J15))),\"\")","v":""},{"$f":"IFERROR(VLOOKUP(J15,Invoices!$C:$L,5,FALSE),\"\")","v":""},{"$f":"IFERROR(VLOOKUP(J15,Invoices!$C:$L,9,FALSE),\"\")","v":""},null,{"$f":"IF(ROWS(N$6:N15)<=O$4,INDEX(Invoices!$C$5:$C$104,SMALL(IF(Invoices!$I$5:$I$104=O$5,ROW(Invoices!$C$5:$C$104)-ROW(Invoices!$C$5)+1),ROWS(N$6:N15))),\"\")","v":""},{"$f":"IFERROR(VLOOKUP(N15,Invoices!$C:$L,5,FALSE),\"\")","v":""},{"$f":"IFERROR(VLOOKUP(N15,Invoices!$C:$L,9,FALSE),\"\")","v":""},null,{"$f":"IF(ROWS(R$6:R15)<=S$4,INDEX(Invoices!$C$5:$C$104,SMALL(IF(Invoices!$I$5:$I$104=S$5,ROW(Invoices!$C$5:$C$104)-ROW(Invoices!$C$5)+1),ROWS(R$6:R15))),\"\")","v":""},{"$f":"IFERROR(VLOOKUP(R15,Invoices!$C:$L,5,FALSE),\"\")","v":""},{"$f":"IFERROR(VLOOKUP(R15,Invoices!$C:$L,9,FALSE),\"\")","v":""}]
{"$rows_left_out":95}
{"sheet":"Eligible Costs","index":4,"n_rows":7,"n_cols":1,"rows_kept":7,"cut":false,"hidden":true,"merged":[]}
[]
["Remodeling"]
["Deferred Maintenance"]
["Installation"]
["Materials"]
["Maintaining/Repairing Common Areas"]
["Ineligible Costs"]

{"sheet":"All schools","index":5,"n_rows":348,"n_cols":3,"rows_kept":348,"cut":false,"hidden":true,"merged":[]}
["CDS Code","Name of Charter School ","Charter #"]
[39686270128553,"Acacia Elementary Charter",1518]
[39686270128546,"Acacia Middle Charter",1519]
[19101990109926,"Academia Avance Charter",738]
[19647336119929,"Academia Semillas del Pueblo (Xinaxcalmecac )",447]
[19647330126185,"Academy of Science and Engineering",1411]
[23656152330454,"Accelerated Achievement Academy ",439]
[19647330100743,"Accelerated Elementary Charter",539]
[37683380111898,"Albert Einstein Academy Charter Middle",773]
[19647330121285,"Alliance Cindy and Bill Simon Technology Academy High",1161]
[19647330123141,"Alliance College-Ready Academy High No. 16",1164]
[19647330124941,"Alliance College-Ready Academy High No. 18",1356]
[19647330127217,"Alliance College-Ready Academy High No. 20",1164]
[19647330111492,"Alliance College-Ready Academy High No. 5",789]
[19647330128058,"Alliance College-Ready Middle Academy No. 12",1533]
{"$rows_left_out":334}
{"sheet":"Instructions","index":6,"n_rows":0,"n_cols":0,"rows_kept":0,"cut":false,"hidden":false,"merged":[]}

{"sheet":"FAQ","index":7,"n_rows":0,"n_cols":0,"rows_kept":0,"cut":false,"hidden":false,"merged":[]}