{"text_format":"1","workbook":"xlsx","n_sheets":10,"sheets":["Instructions and FAQs","APPLICATION PHASE","CALCS","PLACED IN SERVICE PHASE","CALCS2","Min. Construction+CAS+CALGreen","ZNE Calculation","Project Submission Requirements","Rehab Verification Quals Final","NC Verification Quals"],"not_rendered":{"charts":0,"images":18,"macros":1,"external_links":0,"defined_names":14,"comments":2,"pivot_tables":0},"unopened":[],"bounds":{"document_bytes":16777216,"sheet_cells":100000,"rows_first":2000,"rows_last":500,"rows_between":2000,"halvings":0,"cell_chars":16384,"cell_head_chars":4096},"cells_cut":0,"cells_raw":0,"read":"whole","date_system":"1900"}

{"sheet":"Instructions and FAQs","index":0,"n_rows":622,"n_cols":3,"rows_kept":622,"cut":false,"hidden":false,"merged":[[457,1,457,6],[459,1,459,6],[468,1,468,6],[173,1,173,6],[175,1,175,6],[192,1,192,6],[194,1,194,6],[247,1,247,6],[380,1,380,6],[382,1,382,6],[423,1,423,6],[437,1,437,6],[438,1,438,6],[439,1,439,6],[428,1,428,6],[429,1,429,6],[430,1,430,6],[431,1,431,6],[432,1,432,6],[433,1,433,6],[434,1,434,6],[435,1,435,6],[436,1,436,6],[424,1,424,6],[118,1,118,6],[169,1,169,6],[164,1,164,6],[159,1,159,6],[158,1,158,6],[156,1,156,6],[155,1,155,6],[154,1,154,6],[153,1,153,6],[152,1,152,6],[131,1,131,6],[134,1,134,6],[135,1,135,6],[137,1,137,6],[138,1,138,6],[133,1,133,6],[122,1,122,6],[123,1,123,6],[124,1,124,6],[129,1,129,6],[130,1,130,6],[125,1,125,6],[165,1,165,6],[481,1,481,6],[482,1,482,6],[483,1,483,6],[474,1,474,6],[613,1,613,6],[568,1,568,6],[569,1,569,6],[570,1,570,6],[571,1,571,6],[572,1,572,6],[573,1,573,6],[574,1,574,6],[606,1,606,6],[611,1,611,6],[612,1,612,6],[602,1,602,6],[603,1,603,6],[604,1,604,6],[605,1,605,6],[607,1,607,6],[609,1,609,6],[565,1,565,6],[566,1,566,6],[567,1,567,6],[558,1,558,6],[559,1,559,6],[560,1,560,6],[555,1,555,6],[556,1,556,6],[557,1,557,6],[512,1,512,6],[513,1,513,6],[514,1,514,6],[515,1,515,6],[516,1,516,6],[517,1,517,6],[547,1,547,6],[548,1,548,6],[549,1,549,6],[550,1,550,6],[553,1,553,6],[521,1,521,6],[520,1,520,6],[509,1,509,6],[510,1,510,6],[511,1,511,6],[503,1,503,6],[504,1,504,6],[505,1,505,6],[506,1,506,6],[507,1,507,6],[508,1,508,6],[497,1,497,6],[498,1,498,6],[499,1,499,6],[500,1,500,6],[501,1,501,6],[502,1,502,6],[472,1,472,6],[473,1,473,6],[496,1,496,6],[475,1,475,6],[492,1,492,6],[493,1,493,6],[494,1,494,6],[495,1,495,6],[484,1,484,6],[485,1,485,6],[486,1,486,6],[487,1,487,6],[488,1,488,6],[489,1,489,6],[490,1,490,6],[476,1,476,6],[477,1,477,6],[478,1,478,6],[425,1,425,6],[426,1,426,6],[391,1,391,6],[395,1,395,6],[396,1,396,6],[397,1,397,6],[398,1,398,6],[399,1,399,6],[400,1,400,6],[401,1,401,6],[405,1,405,6],[406,1,406,6],[416,1,416,6],[417,1,417,6],[421,1,421,6],[420,1,420,6],[414,1,414,6],[415,1,415,6],[413,1,413,6],[412,1,412,6],[403,1,403,6],[404,1,404,6],[402,1,402,6],[346,1,346,6],[347,1,347,6],[349,1,349,6],[333,1,333,6],[334,1,334,6],[335,1,335,6],[336,1,336,6],[337,1,337,6],[338,1,338,6],[339,1,339,6],[340,1,340,6],[342,1,342,6],[321,1,321,6],[322,1,322,6],[323,1,323,6],[324,1,324,6],[328,1,328,6],[332,1,332,6],[343,1,343,6],[344,1,344,6],[345,1,345,6],[312,1,312,6],[313,1,313,6],[314,1,314,6],[315,1,315,6],[316,1,316,6],[317,1,317,6],[318,1,318,6],[319,1,319,6],[320,1,320,6],[306,1,306,6],[303,1,303,6],[304,1,304,6],[309,1,309,6],[310,1,310,6],[311,1,311,6],[250,1,250,6],[299,1,299,6],[268,1,268,6],[269,1,269,6],[297,1,297,6],[266,1,266,6],[267,1,267,6],[298,1,298,6],[260,1,260,6],[261,1,261,6],[262,1,262,6],[263,1,263,6],[264,1,264,6],[265,1,265,6],[305,1,305,6],[307,1,307,6],[53,1,53,6],[54,1,54,6],[188,1,188,6],[191,1,191,6],[255,1,255,6],[189,1,189,6],[302,1,302,6],[167,1,167,6],[168,1,168,6],[157,1,157,6],[55,1,55,6],[56,1,56,6],[57,1,57,6],[62,1,62,6],[63,1,63,6],[64,1,64,6],[65,1,65,6],[66,1,66,6],[195,1,195,6],[117,1,117,6],[301,1,301,6],[208,1,208,6],[300,1,300,6],[246,1,246,6],[50,1,50,6],[52,1,52,6],[2,1,2,6],[35,1,35,6],[37,1,37,6],[38,1,38,6],[40,1,40,6],[43,1,43,6],[41,1,41,6],[42,1,42,6],[46,1,46,6],[44,1,44,6],[45,1,45,6],[3,1,3,6],[4,1,4,6],[49,1,49,6],[5,1,5,6],[6,1,6,6],[8,1,8,6],[7,1,7,6],[51,1,51,6],[9,1,9,6],[17,1,17,6],[19,1,19,6],[200,1,200,6],[90,1,90,6],[79,1,79,6],[91,1,91,6],[67,1,67,6],[93,1,93,6],[72,1,72,6],[73,1,73,6],[75,1,75,6],[74,1,74,6],[76,1,76,6],[77,1,77,6],[78,1,78,6],[88,1,88,6],[89,1,89,6],[68,1,68,6],[69,1,69,6],[70,1,70,6],[92,1,92,6],[71,1,71,6],[81,1,81,6],[82,1,82,6],[83,1,83,6],[99,1,99,6],[206,1,206,6],[204,1,204,6],[1,1,1,6],[215,1,215,6],[216,1,216,6],[271,1,271,6],[272,1,272,6],[21,1,21,6],[33,1,33,6],[94,1,94,6],[95,1,95,6],[96,1,96,6],[114,1,114,6],[132,1,132,6],[101,1,101,6],[115,1,115,6],[136,1,136,6],[243,1,243,6],[245,1,245,6],[196,1,196,6],[197,1,197,6],[198,1,198,6],[199,1,199,6],[244,1,244,6],[371,1,371,6],[201,1,201,6],[373,1,373,6],[374,1,374,6],[369,1,369,6],[166,1,166,6],[210,1,210,6],[209,1,209,6],[126,1,126,6],[127,1,127,6],[128,1,128,6],[308,1,308,6],[202,1,202,6],[203,1,203,6],[241,1,241,6],[242,1,242,6],[211,1,211,6],[212,1,212,6],[213,1,213,6],[253,1,253,6],[254,1,254,6],[251,1,251,6],[252,1,252,6],[205,1,205,6],[372,1,372,6],[207,1,207,6],[375,1,375,6],[376,1,376,6],[377,1,377,6],[615,1,615,6],[348,1,348,6],[350,1,350,6],[353,1,353,6],[355,1,355,6],[359,1,359,6],[361,1,361,6],[408,1,408,6],[418,1,418,6],[551,1,551,6],[352,1,352,6],[357,1,357,6],[358,1,358,6],[365,1,365,6],[367,1,367,6],[368,1,368,6],[576,1,576,6],[577,1,577,6],[370,1,370,6]]}
[]
[null,"WORKSHEET INSTRUCTIONS"]
[null,"v 1.3"]
[null,"General Instructions:"]
[null,"* In order for worksheet to work, you must enable macros.*"]
[]
[null,"Printing Instructions: In order to print these worksheets, select Print.  Under the scaling section, please select \"Fit all Columns on One Page\""]
[]
[null,"For  assistance with this worksheet, please contact the project's regional analyst at (916) 654-6340  http://www.treasurer.ca.gov/ctcac/assignments.pdf "]
[null,"GENERAL HELP AND DOCUMENTS"]
{"$rows_left_out":613}
{"sheet":"APPLICATION PHASE","index":1,"n_rows":143,"n_cols":7,"rows_kept":143,"cut":false,"hidden":false,"merged":[[1,1,1,6],[125,1,125,6],[124,1,124,6],[121,1,121,2],[122,1,122,2],[2,2,2,3],[3,2,3,3],[8,1,8,6],[2,5,2,6],[3,5,3,6],[6,2,6,3],[5,2,5,3],[4,2,4,3],[6,4,6,6],[25,2,25,3],[4,5,4,6],[106,2,106,3],[109,2,109,3],[115,2,115,3],[100,1,100,6],[101,1,101,6],[9,1,9,6],[71,1,71,6],[85,1,85,6],[14,1,14,6],[35,1,35,6],[36,1,36,6],[34,1,34,6],[72,1,72,6],[73,1,73,6],[12,1,12,6],[43,1,43,6],[13,1,13,6],[19,2,19,3],[86,1,86,6],[87,1,87,6],[56,2,56,3],[62,2,62,3],[99,1,99,6],[132,2,132,5],[144,1,144,6],[139,2,139,5],[140,2,140,5],[141,2,141,5],[142,2,142,5],[123,1,123,6],[118,1,118,6],[117,1,117,6],[126,1,126,6],[138,2,138,5],[134,2,134,5],[135,2,135,5],[136,2,136,5],[137,2,137,5],[127,2,127,5],[120,1,120,2],[133,2,133,5],[128,2,128,5],[129,2,129,5],[130,2,130,5],[131,2,131,5]]}
[]
[null,"TCAC Sustainable Building Methods Worksheet - APPLICATION PHASE"]
[null,"Project Name:",null,null,"Project Address:"]
[null,"Energy Modeler Name:",null,null,"Energy Modeler Company:"]
[null,"Modeler 2013 CEA ID # (required for all projects):",null,null,"Modeler HERS Whole House Rater ID # (additional requirement for rehab projects only):"]
[null,"Modeler Phone # and E-mail:",null,null,"Application Date:",null,{"$f":"'Instructions and FAQs'!B3","v":"v 1.3"}]
[null,"Application Date:",{"$f":"TODAY()","v":"2015-02-12"}]
[]
[null,"Worksheet instructions: Please ensure that excel macros are enabled.  Fill the worksheet out from top to bottom, and a score will be generated.  This score represents the amount of"]
[null," points anticipated under TCAC's sustainable building methods section.  Please fill out all fields, marking fields that do not apply to your specific project with an \"N/A.\"  Note that all projects,"]
{"$rows_left_out":134}
{"sheet":"CALCS","index":2,"n_rows":50,"n_cols":12,"rows_kept":50,"cut":false,"hidden":true,"merged":[]}
["NEW CONSTRUCTION"]
["TITLE 24",null,"% ZNE"]
["Low Rise",null,"Low Rise"]
[0,0,0,0]
[0.32500000000000001,2,0.2,2]
[0.35,3,0.3,3]
[0.4,5,0.4,4]
[null,null,0.5,5]
["POINTS IF LOW RISE:",{"$f":"INDEX(B4:B7,MATCH('APPLICATION PHASE'!E19,A4:A7,1))","v":0},"POINTS IF LOW RISE:",{"$f":"IF(ISBLANK('APPLICATION PHASE'!E23),0,INDEX(D4:D8,MATCH('APPLICATION PHASE'!E25,C4:C8,1)))","v":0}]
[]
{"$rows_left_out":41}
{"sheet":"PLACED IN SERVICE PHASE","index":3,"n_rows":154,"n_cols":7,"rows_kept":154,"cut":false,"hidden":false,"merged":[[1,1,1,6],[6,4,6,6],[4,2,4,3],[2,2,2,3],[2,5,2,6],[3,2,3,3],[3,5,3,6],[5,2,5,3],[6,2,6,3],[4,5,4,6],[43,1,43,6],[44,1,44,6],[86,1,86,6],[30,2,31,4],[74,2,75,4],[50,1,50,6],[62,2,62,3],[68,2,68,3],[153,2,153,3],[153,5,153,6],[152,2,152,3],[107,1,107,6],[108,1,108,6],[109,1,109,6],[110,1,110,6],[129,1,129,6],[118,2,119,4],[150,1,150,6],[132,5,133,5],[152,5,152,6],[96,2,97,4],[130,1,130,6],[131,1,131,6],[88,1,88,6],[87,1,87,6],[8,1,8,6],[9,1,9,6],[13,1,13,6],[14,1,14,6],[42,1,42,6],[12,1,12,6],[18,2,18,3],[24,2,24,3]]}
[]
[null,"TCAC Sustainable Building Methods Worksheet - PLACED-IN-SERVICE PHASE"]
[null,"Project Name:",null,null,"Project Address:"]
[null,"Energy Modeler Name:",null,null,"Energy Modeler Company:"]
[null,"Modeler 2013 CEA ID # (required for all projects):",null,null,"Modeler HERS Whole House Rater ID # (additional requirement for rehab projects only):"]
[null,"Modeler Phone # and E-mail:",null,null,"Application Date:",null,{"$f":"'Instructions and FAQs'!B3","v":"v 1.3"}]
[null,"Application Date:",{"$f":"TODAY()","v":"2015-02-12"}]
[]
[null,"Worksheet instructions: Please ensure that excel macros are enabled.  Fill the worksheet out from top to bottom, indicating any changes in the energy model for the Placed in Service Phase."]
[null,"Please fill out all fields, marking fields that do not apply to your specific project with an \"N/A.\" Note that all projects, regardless of number of points earned, must meet the minimum "]
{"$rows_left_out":145}
{"sheet":"CALCS2","index":4,"n_rows":48,"n_cols":12,"rows_kept":48,"cut":false,"hidden":true,"merged":[]}
["NEW CONSTRUCTION"]
[null,null,"% ZNE"]
["Low Rise",null,"Low Rise"]
[0,0,0,0]
[0.32500000000000001,2,0.2,2]
[0.35,3,0.3,3]
[0.4,5,0.4,4]
["POINTS IF LOW RISE:",{"$f":"INDEX(B4:B7,MATCH('PLACED IN SERVICE PHASE'!E18,A4:A7,1))","v":0},0.5,5]
[null,null,"POINTS IF LOW RISE:",{"$f":"IF(ISBLANK('PLACED IN SERVICE PHASE'!E22),0,INDEX(D4:D8,MATCH('PLACED IN SERVICE PHASE'!E24,C4:C8,1)))","v":0}]
[]
{"$rows_left_out":39}
{"sheet":"Min. Construction+CAS+CALGreen","index":5,"n_rows":91,"n_cols":7,"rows_kept":91,"cut":false,"hidden":false,"merged":[[3,2,3,3],[3,5,3,6],[88,1,88,6],[90,1,90,2],[90,3,90,6],[54,1,54,4],[58,1,58,4],[62,1,62,4],[74,1,74,4],[80,1,80,4],[84,1,84,4],[1,1,1,6],[47,1,47,4],[5,2,5,3],[7,1,7,6],[8,1,8,6],[10,1,10,4],[24,1,24,4],[28,1,28,6],[29,1,29,4],[34,1,34,4],[39,1,39,4],[43,1,43,4],[4,2,4,3],[4,5,4,6],[2,2,2,3],[2,5,2,6]]}
[]
[null,"TCAC Sustainable Building Methods Worksheet - Minimum Construction Standards, CAS, and CALGreen Checklist"]
[null,"Building Name:",{"$f":"'PLACED IN SERVICE PHASE'!C3","v":0},null,"Building Address:",{"$f":"'PLACED IN SERVICE PHASE'!F3","v":0}]
[null,"Verifier Name and Company:",null,null,"Verifier Company:"]
[null,"Verifier GreenPoint Rater or LEED for Homes Green Rater ID #:",null,null,"Verifier HERS Whole House Rater ID #:"]
[null,"Verifier Phone # and E-mail:",null,null,"Application Date:",null,{"$f":"'Instructions and FAQs'!B3","v":"v 1.3"}]
[]
[null,"Worksheet instructions: Please ensure that excel macros are enabled.  All projects, including non-competitive projects, must meet the minimum construction standards , as outlined in Section 10325(f)(7) of the TCAC regulations.   Complete CALGreen Compliance is required for all New Construction projects, and on a measure-by-measure basis for all Rehabilitation projects.  The CALGreen verifier (a HERS II Rater, Multifamily GreenPoint Rater, or LEED for Homes Green Rater) will indicate whether each specific CALGreen requirement is met, unmet, or not applicable, and provide notes on how the building has met each requirement.  The verifier should keep all verification documentation in the case that it is requested by TCAC.  Note that while this worksheet provides a summary of all mandatory measures required by TCAC, the verifier should always refer to the complete CALGreen code documentation for complete descriptions of all measures.  Please fill out all fields, marking fields that do not apply to your specific project with an \"N/A.\""]
[null,"Documentation of compliance shall include, but is not limited to, construction documents,  plans, specifications,  builder or installer certification, inspection reports, or other methods acceptable to the local enforcing agency.  Other specific documentation  or special inspections  necessary to verify compliance are specified in appropriate sections of CALGreen. Referenced worksheets and full CALGreen text can be found at:"]
[null,"http://www.hcd.ca.gov/CALGreen.html"]
{"$rows_left_out":82}
{"sheet":"ZNE Calculation","index":6,"n_rows":24,"n_cols":15,"rows_kept":24,"cut":false,"hidden":false,"merged":[[9,1,9,2],[1,1,1,14],[2,1,2,2],[4,1,4,2],[5,1,5,2],[8,1,8,2],[12,1,12,2],[13,1,13,2],[16,1,16,2],[16,16,16,18],[17,1,17,2],[17,16,17,17],[19,7,19,13],[20,7,20,13],[21,7,21,13],[22,7,22,13],[23,10,23,13]]}
[]
[null,"Residential Energy Use Summary for TCAC Zero Net Energy Calculations "]
[null,"Type of Residential Energy Use",null,"Space Heating","Space Cooling","Domestic Hot Water","Plug Loads","Lighting","Refrigerators","Cooking","Dishwashers","Laundry Washer","Laundry Dryer","Individual Apartment's Annual Consumption ","Combined Apartments' Annual Consumption "]
[null,"Number of One (1) Bedroom Units",0]
[null,"Electricity Consumption (kWh/year)",null,null,null,null,null,null,null,null,null,null,null,{"$f":"SUM(D5:M5)","v":0},{"$f":"C4*N5","v":0}]
[null,"Gas Consumption (kBTU/year)",null,null,null,null,null,null,null,null,null,null,null,{"$f":"SUM(D6:M6)","v":0},{"$f":"C4*N6","v":0}]
[]
[null,"Number of Two (2) Bedroom Units",0," ",null,null,null,null,null," ",null,null,null,null," "]
[null,"Electricity Consumption (kWh/year)",null,null,null,null,null,null,null,null,null,null,null,{"$f":"SUM(D9:M9)","v":0},{"$f":"C8*N9","v":0}]
[null,"Gas Consumption (kBTU/year)",null,null,null,null,null,null,null,null,null,null,null,{"$f":"SUM(D10:M10)","v":0},{"$f":"C8*N10","v":0}]
{"$rows_left_out":15}
{"sheet":"Project Submission Requirements","index":7,"n_rows":71,"n_cols":7,"rows_kept":71,"cut":false,"hidden":false,"merged":[[1,3,1,6],[4,1,6,1],[4,2,6,2],[4,3,6,3],[4,4,5,4],[4,5,5,5],[4,6,6,6],[13,6,18,6],[16,4,17,4],[16,5,17,5],[8,1,12,1],[8,2,12,2],[8,3,12,3],[8,4,10,4],[8,5,10,5],[8,6,12,6],[13,1,18,1],[13,2,18,2],[13,3,18,3],[13,4,15,4],[13,5,15,5],[19,4,19,5],[26,3,26,6],[28,1,35,1],[28,2,35,2],[28,3,35,3],[28,4,31,4],[28,5,31,5],[28,6,35,6],[34,4,35,4],[34,5,35,5],[36,6,42,6],[41,4,42,4],[41,5,42,5],[44,1,53,1],[44,2,53,2],[44,3,53,3],[44,4,48,4],[44,5,48,5],[44,6,53,6],[52,4,53,4],[36,1,42,1],[36,2,42,2],[36,3,42,3],[36,4,38,4],[36,5,38,5],[64,1,64,3],[52,5,53,5],[54,1,63,1],[54,2,63,2],[54,3,63,3],[54,4,57,4],[54,5,57,5],[65,4,65,5],[54,6,63,6],[58,4,59,4],[58,5,59,5],[62,4,63,4],[62,5,63,5]]}
[]
[null,null,null,"Application Phase"]
[null,null,null,"Analysis Software","Submission Documents","Document Descriptions","TCAC Scoring Criteria"]
[null,"New Construction","Low-rise"," Energy Pro or Micropas Residential T-24 compliance *","CF-1R: Certificate of Compliance-Residential and .bld or .mp8 file ","The CF-1R summarizes the minimum energy performance specifications needed for compliance, including the results of the heating and cooling load calculations. The Standards require that a certificate of compliance be included on the plans. CEC approved performance ACM software automatically generates CF-1R forms.","CF1R\nPercent better than standard (T-24)"]
[null,"New Construction","High-Rise","Energy Pro Non-Residential T-24 compliance *","Non-Residential Performance T-24 Form (PERF-1C) and .bld file","The PERF-1C summarizes the minimum energy performance specifications needed for compliance, including the results of the heating and cooling load calculations. The Standards require that a certificate of compliance be included on the plans.  CEC approved performance ACM software automatically generates PERF-1 forms.","PERF-1C\nPercent better than standard (T-24)"]
[]
[null,null,null,null,"Other applicable compliance forms, as needed","Other compliance forms may be required depending upon the specific measures in your project.  Please refer to the Nonresidential Compliance Manual, Appendix A (http://www.energy.ca.gov/2008publications/CEC-400-2008-017/rev1_appendices/NRCM_Appendix_A.pdf)"]
[]
[null,"Rehab","Low-Rise","EnergyPro (Residential Performance)","ECON-2 and .bld file ","ECON-2 summarizes the TDV and the recommended measures.  If a two model approach is taken submission should include 2 ECON-2's and 2 .bld files.  The .bld files are for TCAC QA review purposes.","ECON 2\nimprovement in TDV  (ktbu/sq ft/yr)"]
[]
{"$rows_left_out":62}
{"sheet":"Rehab Verification Quals Final","index":8,"n_rows":44,"n_cols":5,"rows_kept":44,"cut":false,"hidden":false,"merged":[[16,3,16,4],[2,1,3,1],[2,2,3,2],[2,3,3,3],[2,4,3,4],[4,1,5,1],[4,2,5,2],[4,3,5,3],[5,4,6,4]]}
[]
[null,"Task","New Minimum Qualification","                 Alternative Min. Qualification                                        (Approved by the Executive Director on a case-by-case basis)","Additional Recommended Qualifications for building owner to consider/follow up on"]
[null,"Whole Building Energy Assessment and Recommendations","Must have two of the following certifications:\n- HERS Whole House (HERS II) Rater\n- BPI Multifamily Building Analyst\n- Green Point Rater for Existing Home Multifamily","Alternative Min. Qualification: Meet requirements of CA EMF training petition procedure similar to Build it Green/TRC process; TCAC Executive Director to make final determination/approval.\n\nhttp://builditgreen.org/GPR-prerequisites-eligibility/","Tier 1:  At least a PE, CEM, BPI Multifamily Building Analyst"]
[]
[null,"Energy Modeling","California Association of Building Energy Consultants (CABEC) 2013 Certified Energy Analyst (2013 CEA) (Nonres CEA for HR MF and Res CEA for low-rise MF.) and a HERS Whole House (HERS II) Rater. The consultant preparing the \"as-built\" energy model shall be responsible for verifying that all the energy efficiency measures have been met, including verification of installation certificates (CF-6R forms) and field verification certificates (CF-4R forms) for Low-rise and required acceptance testing forms for High-rise","N/A","Tier 2:  A HERS II rater, 3 years experience in MF buildings, GPR EH MF Rater, CEPE (res or non res)"]
[null,null,null,null,"Recommended questions for building owner to ask auditor:\n1.  How many buildings have you audited?\n2.  How many buildings like mine?\n3.  What are typical savings that you find/predict?\n4.  How much of the recommended work is typically acted on?\n5.  Can I see three sample reports from your previous jobs?\n6.  Can I have three references?"]
[null,"Third-Party Verification ","HERS Whole House (HERS II) Rater","N/A"]
[null,"Commissioning and Retro Commissioning (required for some HR measures; good practice for some others)","Commissioning - Meet requirements of BIG or Cal Green (*see below)\nhttp://www.documents.dgs.ca.gov/bsc/CALGreen/Non-Res-Comm-Guide-10-10.pdf, OR                                                                                                                                   Person or Firm doing the commissioning must be on the approved list with the California Commissioning Collaborative <http://www.cacx.org/resources/selecting.html>   The Cx agent does not have to be an independent third party.","Commissioning or Retro Commissioning Certification from one of the following certifying bodies:  Association of Energy Engineers, AABC Commissioning Group, ASHRAE, National Environmental Balancing Bureau, Testing Adjusting and Balancing Bureau or University of Wisconsin-Madison","See California Commissioning Collaborative \"How to Select a Cx Provider\"\nhttp://www.cacx.org/resources/selecting.html"]
[null,"Combustion appliance safety","BPI Building Analyst  or HERS Building Performance Contractor","N/A","N/A"]
[null,"Feasibility of renewable energy installation","CSI Approved Contractor (valid A, B, C-10, or C-46 license)","N/A","N/A"]
{"$rows_left_out":35}
{"sheet":"NC Verification Quals","index":9,"n_rows":13,"n_cols":4,"rows_kept":13,"cut":false,"hidden":false,"merged":[[3,1,4,1],[5,1,12,1]]}
[]
[]
[null,"Applicability","Task","Minimum Qualification"]
[null,"Required for all Multifamily Projects","Energy Modeling","California Association of Building Energy Consultants (CABEC) 2013 Certified Energy Analyst (CEA) (Nonres CEA for high-rise MF and Res CEA for low-rise MF). The consultant preparing the \"as-built\" energy model shall be responsible for verifying that all the energy efficiency measures have been met, including verification of installation certificates (CF-6R forms) and field verification certificates (CF-4R forms) for Low-rise and required acceptance testing forms for High-rise"]
[null,null,"Verification","HERS Whole House (HERS II) Rater"]
[null,"Required depending on scope","HVAC system efficiency and balancing (including duct testing)","California Field Verification and Diagnostic Testing Rater (one level of HERS Rater)"]
[null,null,"Central domestic water heating and distribution system efficiency","C-36 plumbing or C-4 boiler contractor license for renovation recommendations and all installation, and HERS Rater for verification"]
[null,null,"Commissioning (required for some HR measures; good practice for many others)","Trained Contractor, Commissioning Agent accredited through CEC approved program."]
[null,null,"Water, IAQ and resources measures","GreenPoint Rated Multifamily Rater "]
[null,null,"Combustion appliance safety","BPI Analyst"]
{"$rows_left_out":3}