{"text_format":"1","workbook":"xlsx","n_sheets":9,"sheets":["Instructions","APPLICATION PHASE","CALCS","PLACED IN SERVICE PHASE","CALCS2","CALGreen Checklist","Doc & Ver for Scoring","Rehab Verification Quals Final","NC Verification Quals"],"not_rendered":{"charts":0,"images":42,"macros":1,"external_links":0,"defined_names":13,"comments":0,"pivot_tables":0},"unopened":[],"bounds":{"document_bytes":16777216,"sheet_cells":100000,"rows_first":2000,"rows_last":500,"rows_between":2000,"halvings":0,"cell_chars":16384,"cell_head_chars":4096},"cells_cut":0,"cells_raw":0,"read":"whole","date_system":"1900"}

{"sheet":"Instructions","index":0,"n_rows":402,"n_cols":7,"rows_kept":402,"cut":false,"hidden":false,"merged":[[245,1,245,6],[246,1,246,6],[247,1,247,6],[248,1,248,6],[249,1,249,6],[67,1,67,6],[68,1,68,6],[69,1,69,6],[71,1,71,6],[86,1,86,6],[70,1,70,6],[72,1,72,6],[90,1,90,6],[120,1,120,6],[159,1,159,6],[160,1,160,6],[157,1,157,6],[158,1,158,6],[139,1,139,6],[140,1,140,6],[141,1,141,6],[142,1,142,6],[143,1,143,6],[144,1,144,6],[398,1,398,6],[223,1,223,6],[225,1,225,6],[229,1,229,6],[231,1,231,6],[235,1,235,6],[237,1,237,6],[268,1,268,6],[278,1,278,6],[361,1,361,6],[227,1,227,6],[233,1,233,6],[234,1,234,6],[239,1,239,6],[240,1,240,6],[241,1,241,6],[242,1,242,6],[243,1,243,6],[244,1,244,6],[250,1,250,6],[251,1,251,6],[252,1,252,6],[253,1,253,6],[263,1,263,6],[1,1,1,5],[172,1,172,6],[173,1,173,6],[177,1,177,6],[166,1,166,6],[167,1,167,6],[168,1,168,6],[169,1,169,6],[170,1,170,6],[171,1,171,6],[54,1,54,6],[55,1,55,6],[56,1,56,6],[121,1,121,6],[106,1,106,6],[107,1,107,6],[108,1,108,6],[109,1,109,6],[110,1,110,6],[114,1,114,6],[115,1,115,6],[116,1,116,6],[117,1,117,6],[44,1,44,6],[178,1,178,6],[174,1,174,6],[175,1,175,6],[176,1,176,6],[145,1,145,6],[146,1,146,6],[147,1,147,6],[122,1,122,6],[85,1,85,6],[112,1,112,6],[113,1,113,6],[88,1,88,6],[89,1,89,6],[91,1,91,6],[92,1,92,6],[87,1,87,6],[74,1,74,6],[76,1,76,6],[77,1,77,6],[78,1,78,6],[83,1,83,6],[84,1,84,6],[79,1,79,6],[80,1,80,6],[81,1,81,6],[82,1,82,6],[63,1,63,6],[53,1,53,6],[64,1,64,6],[40,1,40,6],[66,1,66,6],[45,1,45,6],[46,1,46,6],[48,1,48,6],[49,1,49,6],[47,1,47,6],[50,1,50,6],[51,1,51,6],[52,1,52,6],[61,1,61,6],[62,1,62,6],[41,1,41,6],[42,1,42,6],[43,1,43,6],[65,1,65,6],[24,1,24,6],[26,1,26,6],[2,1,2,6],[9,1,9,6],[11,1,11,6],[12,1,12,6],[14,1,14,6],[17,1,17,6],[15,1,15,6],[16,1,16,6],[20,1,20,6],[18,1,18,6],[19,1,19,6],[3,1,3,6],[4,1,4,6],[23,1,23,6],[5,1,5,6],[6,1,6,6],[8,1,8,6],[7,1,7,6],[25,1,25,6],[184,1,184,6],[138,1,138,6],[186,1,186,6],[27,1,27,6],[28,1,28,6],[29,1,29,6],[124,1,124,6],[127,1,127,6],[128,1,128,6],[161,1,161,6],[125,1,125,6],[181,1,181,6],[118,1,118,6],[119,1,119,6],[111,1,111,6],[31,1,31,6],[32,1,32,6],[34,1,34,6],[35,1,35,6],[36,1,36,6],[30,1,30,6],[37,1,37,6],[38,1,38,6],[39,1,39,6],[187,1,187,6],[129,1,129,6],[130,1,130,6],[131,1,131,6],[132,1,132,6],[133,1,133,6],[134,1,134,6],[135,1,135,6],[136,1,136,6],[137,1,137,6],[148,1,148,6],[149,1,149,6],[150,1,150,6],[151,1,151,6],[153,1,153,6],[154,1,154,6],[155,1,155,6],[156,1,156,6],[152,1,152,6],[180,1,180,6],[179,1,179,6],[185,1,185,6],[182,1,182,6],[183,1,183,6],[188,1,188,6],[189,1,189,6],[190,1,190,6],[191,1,191,6],[192,1,192,6],[193,1,193,6],[194,1,194,6],[195,1,195,6],[196,1,196,6],[197,1,197,6],[198,1,198,6],[199,1,199,6],[200,1,200,6],[201,1,201,6],[202,1,202,6],[203,1,203,6],[204,1,204,6],[205,1,205,6],[215,1,215,6],[216,1,216,6],[217,1,217,6],[219,1,219,6],[220,1,220,6],[221,1,221,6],[222,1,222,6],[224,1,224,6],[206,1,206,6],[207,1,207,6],[208,1,208,6],[209,1,209,6],[210,1,210,6],[211,1,211,6],[212,1,212,6],[213,1,213,6],[214,1,214,6],[218,1,218,6],[264,1,264,6],[265,1,265,6],[266,1,266,6],[267,1,267,6],[276,1,276,6],[277,1,277,6],[281,1,281,6],[280,1,280,6],[274,1,274,6],[275,1,275,6],[273,1,273,6],[272,1,272,6],[254,1,254,6],[255,1,255,6],[256,1,256,6],[257,1,257,6],[258,1,258,6],[259,1,259,6],[260,1,260,6],[261,1,261,6],[262,1,262,6],[282,1,282,6],[283,1,283,6],[296,1,296,6],[297,1,297,6],[298,1,298,6],[287,1,287,6],[288,1,288,6],[289,1,289,6],[290,1,290,6],[291,1,291,6],[292,1,292,6],[293,1,293,6],[294,1,294,6],[295,1,295,6],[284,1,284,6],[285,1,285,6],[286,1,286,6],[335,1,335,6],[336,1,336,6],[337,1,337,6],[338,1,338,6],[339,1,339,6],[340,1,340,6],[312,1,312,6],[313,1,313,6],[334,1,334,6],[315,1,315,6],[330,1,330,6],[331,1,331,6],[332,1,332,6],[333,1,333,6],[322,1,322,6],[323,1,323,6],[324,1,324,6],[325,1,325,6],[326,1,326,6],[327,1,327,6],[328,1,328,6],[316,1,316,6],[317,1,317,6],[318,1,318,6],[347,1,347,6],[348,1,348,6],[349,1,349,6],[341,1,341,6],[342,1,342,6],[343,1,343,6],[344,1,344,6],[345,1,345,6],[346,1,346,6],[368,1,368,6],[369,1,369,6],[370,1,370,6],[365,1,365,6],[366,1,366,6],[367,1,367,6],[350,1,350,6],[351,1,351,6],[352,1,352,6],[353,1,353,6],[354,1,354,6],[355,1,355,6],[356,1,356,6],[357,1,357,6],[358,1,358,6],[359,1,359,6],[360,1,360,6],[363,1,363,6],[319,1,319,6],[320,1,320,6],[321,1,321,6],[314,1,314,6],[396,1,396,6],[378,1,378,6],[379,1,379,6],[380,1,380,6],[381,1,381,6],[382,1,382,6],[383,1,383,6],[384,1,384,6],[389,1,389,6],[394,1,394,6],[395,1,395,6],[385,1,385,6],[386,1,386,6],[387,1,387,6],[388,1,388,6],[390,1,390,6],[392,1,392,6],[375,1,375,6],[376,1,376,6],[377,1,377,6]]}
[]
[null,"WORKSHEET INSTRUCTIONS",null,null,null,null,"v 1.04"]
[]
[null,"General Instructions:"]
[null,"* In order for worksheet to work, you must enable macros.*"]
[]
[null,"Printing Instructions: In order to print these worksheets, select Print.  Under the scaling section, please select \"Fit all Columns on One Page\""]
[]
[null,"For  assistance with this worksheet, please contact Rachel Harmon at the Assocation for Energy Affordability (510.431.1795)."]
[null,"TAB 1: APPLICATION PHASE"]
[]
[null,"This tab is intended to be used during the TCAC application phase for projects applying for points under the Sustainable Building Methods Section (Section 6).  This tab will calculate  "]
[null,"the number of application points for your projects based off of user-inputs."]
[]
[null,"General Information:"]
{"$rows_left_out":388}
{"sheet":"APPLICATION PHASE","index":1,"n_rows":129,"n_cols":7,"rows_kept":129,"cut":false,"hidden":false,"merged":[[128,2,128,3],[125,1,125,6],[118,3,118,4],[119,3,119,4],[120,3,120,4],[121,3,121,4],[122,3,122,4],[123,3,123,4],[128,5,128,6],[56,1,56,6],[57,1,57,6],[70,1,70,6],[71,1,71,6],[83,1,83,6],[117,3,117,4],[110,3,110,4],[111,3,111,4],[112,3,112,4],[108,3,108,4],[114,3,114,4],[113,3,113,4],[115,3,115,4],[116,3,116,4],[88,2,88,3],[91,2,91,3],[97,2,97,3],[84,1,84,6],[85,1,85,6],[99,1,99,6],[109,3,109,4],[127,2,127,3],[127,5,127,6],[9,1,9,6],[55,1,55,6],[69,1,69,6],[100,1,100,6],[106,1,106,6],[105,1,105,6],[14,1,14,6],[102,1,102,2],[103,1,103,2],[26,1,26,6],[27,1,27,6],[25,1,25,6],[33,1,33,6],[46,1,46,6],[1,1,1,5],[2,2,2,3],[3,2,3,3],[8,1,8,6],[2,5,2,6],[3,5,3,6],[6,2,6,3],[5,5,5,6],[5,2,5,3],[4,2,4,3],[4,4,4,6],[6,4,6,6],[13,1,13,6]]}
[]
[null,"TCAC Sustainable Building Methods Worksheet - APPLICATION PHASE",null,null,null,null,{"$f":"Instructions!G2","v":"v 1.04"}]
[null,"Building Name:",null,null,"Building Address:"]
[null,"Modeler Name:",null,null,"Modeler Company:"]
[null,"Modeler CEPE ID #:",null,null,"Required for all rehab projects:"]
[null,"Modeler Phone # and E-mail:",null,null,"Modeler HERS Whole House Rater ID #:"]
[null,"Application Date:",{"$f":"TODAY()","v":"2014-09-05"}]
[]
[null,"Worksheet instructions: Please ensure that excel macros are enabled.  Fill the worksheet out from top to bottom."]
[null,"Please fill out all fields, marking fields that do not apply to your specific project with an \"N/A.\""]
[]
[null,null,null,"Select Project Type:","Please Select"]
[]
[null," New Construction Low-Rise:"]
[null,"For new construction low-rise projects, the energy modeler will reference the \"Percent Better than Standard\" shown on the CF-1R generated in EnergyPro (Res T-24) or MicroPas."]
{"$rows_left_out":115}
{"sheet":"CALCS","index":2,"n_rows":45,"n_cols":8,"rows_kept":45,"cut":false,"hidden":true,"merged":[]}
["NEW CONSTRUCTION"]
[]
["Low Rise"]
[0,0]
[0.17499999999999999,2]
[0.2,3]
[0.25,5]
["POINTS IF LOW RISE:",{"$f":"INDEX(B4:B7,MATCH('APPLICATION PHASE'!E17,A4:A7,1))","v":0}]
[]
["High Rise"]
[0,0]
[0.17499999999999999,3]
[0.2,5]
["POINTS IF HIGH RISE:",{"$f":"INDEX(B11:B13,MATCH(C16,A11:A13,1))","v":0},{"$f":"'APPLICATION PHASE'!E31-'APPLICATION PHASE'!E35-'APPLICATION PHASE'!E38-'APPLICATION PHASE'!E41-'APPLICATION PHASE'!E44","v":0},"adjusted TDV"]
[null,null,{"$f":"'APPLICATION PHASE'!E32-'APPLICATION PHASE'!E36-'APPLICATION PHASE'!E39-'APPLICATION PHASE'!E42-'APPLICATION PHASE'!E45","v":0},"adjusted TDV"]
{"$rows_left_out":31}
{"sheet":"PLACED IN SERVICE PHASE","index":3,"n_rows":136,"n_cols":7,"rows_kept":136,"cut":false,"hidden":false,"merged":[[8,1,8,6],[9,1,9,6],[13,1,13,6],[14,1,14,6],[33,1,33,6],[79,2,80,4],[112,1,112,6],[113,1,113,6],[72,1,72,6],[71,1,71,6],[135,2,135,3],[135,5,135,6],[134,2,134,3],[90,1,90,6],[91,1,91,6],[92,1,92,6],[93,1,93,6],[111,1,111,6],[100,2,101,4],[132,1,132,6],[114,5,115,5],[134,5,134,6],[34,1,34,6],[35,1,35,6],[70,1,70,6],[21,2,22,4],[58,2,59,4],[40,1,40,6],[53,1,53,6],[5,5,5,6],[6,4,6,6],[1,1,1,5],[4,2,4,3],[2,2,2,3],[2,5,2,6],[3,2,3,3],[3,5,3,6],[4,4,4,6],[5,2,5,3],[6,2,6,3]]}
[]
[null,"TCAC Sustainable Building Methods Worksheet - PLACED-IN-SERVICE PHASE",null,null,null,null,{"$f":"Instructions!G2","v":"v 1.04"}]
[null,"Building Name:",{"$f":"'APPLICATION PHASE'!C3:D3","v":0},null,"Building Address:",{"$f":"'APPLICATION PHASE'!F3:G3","v":0}]
[null,"Modeler Name:",{"$f":"'APPLICATION PHASE'!C4:D4","v":0},null,"Modeler Company:",{"$f":"'APPLICATION PHASE'!F4:G4","v":0}]
[null,"Modeler CEPE ID #:",{"$f":"'APPLICATION PHASE'!C5:D5","v":0},null,"Required for all rehab projects:"]
[null,"Modeler Phone # and E-mail:",{"$f":"'APPLICATION PHASE'!C6:D6","v":0},null,"Modeler HERS Whole House Rater ID #:",{"$f":"'APPLICATION PHASE'!F6:G6","v":0}]
[null,"Application Date:",{"$f":"TODAY()","v":"2014-09-05"}]
[]
[null,"Worksheet instructions: Please ensure that excel macros are enabled.  Fill the worksheet out from top to bottom, indicating any changes in the energy model for the Placed in Service Phase."]
[null,"Please fill out all fields, marking fields that do not apply to your specific project with an \"N/A.\""]
[]
[null,null,null,"Select Project Type:","Please Select"]
[]
[null," New Construction Low-Rise:"]
[null,"For new construction low-rise projects, the energy modeler will reference the \"Percent Better than Standard\" shown on the CF-1R generated in EnergyPro (Res T-24) or MicroPas."]
{"$rows_left_out":122}
{"sheet":"CALCS2","index":4,"n_rows":45,"n_cols":8,"rows_kept":45,"cut":false,"hidden":true,"merged":[]}
["NEW CONSTRUCTION"]
[]
["Low Rise"]
[0,0]
[0.17499999999999999,2]
[0.2,3]
[0.25,5]
["POINTS IF LOW RISE:",{"$f":"INDEX(B4:B7,MATCH('PLACED IN SERVICE PHASE'!E17,A4:A7,1))","v":0}]
[]
["High Rise"]
[0,0]
[0.17499999999999999,3]
[0.2,5]
["POINTS IF HIGH RISE:",{"$f":"INDEX(B11:B13,MATCH(C16,A11:A13,1))","v":0},{"$f":"'PLACED IN SERVICE PHASE'!E38-'PLACED IN SERVICE PHASE'!E42-'PLACED IN SERVICE PHASE'!E45-'PLACED IN SERVICE PHASE'!E48-'PLACED IN SERVICE PHASE'!E51","v":0},"adjusted TDV"]
[null,null,{"$f":"'PLACED IN SERVICE PHASE'!E39-'PLACED IN SERVICE PHASE'!E43-'PLACED IN SERVICE PHASE'!E46-'PLACED IN SERVICE PHASE'!E49-'PLACED IN SERVICE PHASE'!E52","v":0},"adjusted TDV"]
{"$rows_left_out":31}
{"sheet":"CALGreen Checklist","index":5,"n_rows":77,"n_cols":7,"rows_kept":77,"cut":false,"hidden":false,"merged":[[1,1,1,5],[10,1,10,6],[2,2,2,3],[2,5,2,6],[3,2,3,3],[3,5,3,6],[4,2,4,3],[4,5,4,6],[5,2,5,3],[5,5,5,6],[7,1,7,6],[8,1,8,6],[9,1,9,6],[49,1,49,4],[11,1,11,6],[13,1,13,4],[18,1,18,4],[21,1,23,1],[21,2,23,2],[21,3,21,6],[26,1,26,4],[30,1,30,4],[34,1,34,4],[41,1,41,4],[45,1,45,4],[60,1,60,4],[65,1,65,4],[69,1,69,4],[74,1,74,6],[76,1,76,2],[76,3,76,6]]}
[]
[null,"TCAC Sustainable Building Methods Worksheet - CALGreen Checklist",null,null,null,null,{"$f":"Instructions!G2","v":"v 1.04"}]
[null,"Building Name:",{"$f":"'APPLICATION PHASE'!C3:D3","v":0},null,"Building Address:",{"$f":"'APPLICATION PHASE'!F3:G3","v":0}]
[null,"Verifier Name and Company:",null,null,"Verifier Company:"]
[null,"Verifier GreenPoint Rater ID #:",null,null,"Verifier HERS Whole House Rater ID #:"]
[null,"Verifier Phone # and E-mail:",null,null,"Application Date:",{"$f":"TODAY()","v":"2014-09-05"}]
[]
[null,"Worksheet instructions: Please ensure that excel macros are enabled.  Complete CALGreen Compliance is required for all New Construction projects, and on a measure-by-measure basis for all Rehabilitation projects.  The CALGreen verifier "]
[null,"(a HERS II Rater or Multifamily GreenPoint Rater) will indicate whether each specific CALGreen requirement is met, unmet, or not applicable, and provide notes on how the building has met each requirement.  The verifier should keep "]
[null,"all verification documentation in the case that it is requested by TCAC.  Note that while this worksheet provides a summary of all manditory measures required by TCAC, the verifier should always refer to the complete CALGreen code"]
[null,"doumentation for complete descriptions of all measures.  Please fill out all fields, marking fields that do not apply to your specific project with an \"N/A.\""]
[null,"Documentation of compliance shall include, but is not limited to, construction documents,  plans, specifications,  builder or installer certification, inspection reports, or other methods acceptable to the local enforcing agency.  Other specific documentation  or special inspections  necessary to verify compliance are specified in appropriate sections of CALGreen. Referenced worksheets and full CALGreen text can be found at:"]
[null,"http://www.hcd.ca.gov/CALGreen.html"]
[null,"Division 4.1 - PLANNING AND DESIGN (SITE DEVELOPMENT)"]
[null,"SECTION","MEASURE NAME","REQUIREMENTS","VERIFICATION METHOD","RESULTS OF VERIFICATION","VERIFIER NOTES"]
{"$rows_left_out":63}
{"sheet":"Doc & Ver for Scoring","index":6,"n_rows":73,"n_cols":7,"rows_kept":73,"cut":false,"hidden":false,"merged":[[66,4,66,5],[55,6,64,6],[59,4,60,4],[59,5,60,5],[63,4,64,4],[63,5,64,5],[65,1,65,3],[53,5,54,5],[55,1,64,1],[55,2,64,2],[55,3,64,3],[55,4,58,4],[55,5,58,5],[37,6,43,6],[42,4,43,4],[42,5,43,5],[45,1,54,1],[45,2,54,2],[45,3,54,3],[45,4,49,4],[45,5,49,5],[45,6,54,6],[53,4,54,4],[37,1,43,1],[37,2,43,2],[37,3,43,3],[37,4,39,4],[37,5,39,5],[19,1,19,3],[20,4,20,5],[27,3,27,6],[29,1,36,1],[29,2,36,2],[29,3,36,3],[29,4,32,4],[29,5,32,5],[29,6,36,6],[35,4,36,4],[35,5,36,5],[13,6,18,6],[16,4,17,4],[16,5,17,5],[8,1,12,1],[8,2,12,2],[8,3,12,3],[8,4,10,4],[8,5,10,5],[8,6,12,6],[13,1,18,1],[13,2,18,2],[13,3,18,3],[13,4,15,4],[13,5,15,5],[1,3,1,6],[4,1,6,1],[4,2,6,2],[4,3,6,3],[4,4,5,4],[4,5,5,5],[4,6,6,6]]}
[]
[null,null,null,"Application Phase"]
[null,null,null,"Analysis Software","Submission Documents","Document Descriptions","TCAC Scoring Criteria"]
[null,"New Construction","Low-rise"," Energy Pro or Micropas Residential T-24 compliance *","CF-1R: Certificate of Compliance-Residential and .bld or .mp8 file ","The CF-1R summarizes the minimum energy performance specifications needed for compliance, including the results of the heating and cooling load calculations. The Standards require that a certificate of compliance be included on the plans. CEC approved performance ACM software automatically generates CF-1R forms.","CF1R\nPercent better than standard (T-24)"]
[null,"New Construction","High-Rise","Energy Pro Non-Residential T-24 compliance *","Non-Residential Performance T-24 Form (PERF-1C) and .bld file","The PERF-1C summarizes the minimum energy performance specifications needed for compliance, including the results of the heating and cooling load calculations. The Standards require that a certificate of compliance be included on the plans.  CEC approved performance ACM software automatically generates PERF-1 forms.","PERF-1C\nPercent better than standard (T-24)"]
[]
[null,null,null,null,"Other applicable compliance forms, as needed","Other compliance forms may be required depending upon the specific measures in your project.  Please refer to the Nonresidential Compliance Manual, Appendix A (http://www.energy.ca.gov/2008publications/CEC-400-2008-017/rev1_appendices/NRCM_Appendix_A.pdf)"]
[]
[null,"Rehabs","Low-Rise","EnergyPro (Residential Performance)","ECON-2 and .bld file ","ECON-2 summarizes the TDV and the recommended measures.  If a two model approach is taken submission should include 2 ECON-2's and 2 .bld files.  The .bld files are for TCAC QA review purposes.","ECONn 2\nimprovement in TDV  (ktbu/sq ft/yr)"]
[]
[]
[null,null,null,null,"Audit Report (HERCC Protocols)**","Audit report showing estimated energy consumptions with existing measures and proposed improvements."]
[null,null,null,null,"Project Plans for existing conditions","Documentation showing project title, address, developer, and building plans.  Building plans for existing conditions should have unit and floor plans, elevation views, dimensions and window callouts.  Plans are not required for the proposed condition at this stage."]
[null,"Rehabs","High-Rise","EnergyPro (Non-Res Performance) ","ECON-2 and .bld file ","ECON-2 summarizes the kWh and therms of the model.  If a two model approach is taken submission should include 2 ECON-2's and 2 .bld files.  The .bld files are for TCAC QA review purposes.","ECON 2\nImprovement in annual total therm and kWh (Auditor to convert values to combined annual btus to show improvement in kbtu/yr)"]
[]
{"$rows_left_out":59}
{"sheet":"Rehab Verification Quals Final","index":7,"n_rows":44,"n_cols":5,"rows_kept":44,"cut":false,"hidden":false,"merged":[[16,3,16,4],[2,1,3,1],[2,2,3,2],[2,3,3,3],[2,4,3,4],[4,1,5,1],[4,2,5,2],[4,3,5,3],[5,4,6,4]]}
[]
[null,"Task","New Minimum Qualification","                 Alternative Min. Qualification                                        (Approved by the Executive Director on a case-by-case basis)","Additional Recommended Qualifications for building owner to consider/follow up on"]
[null,"Whole Building Energy Audit, Recommendations and Utility Data Analysis","CA Existing Building Multifamily Upgrade Training ","Alternative Min. Qualification: Meet requirements of CA EMF training petition procedure similar to BIG/HMG process; TCAC Executive Director to make final determination/approval.\n\nhttp://builditgreen.org/GPR-prerequisites-eligibility/","Tier 1:  At least a PE, CEM, BPI Multifamily Building Analyst"]
[]
[null,"Energy Modeling","California Association of Building Energy Consultants (CABEC) Certified Energy Plans Examiner (CEPE) (Nonres CEPE for HR MF and Res CEPE for low-rise MF.) and a HERS II Rater. The consultant preparing the \"as-built\" energy model shall be responsible for verifying that all the energy efficiency measures have been met, including verification of installation certificates (CF-6R forms) and field verification certificates (CF-4R forms) for Low-rise and required acceptance testing forms for High-rise","N/A","Tier 2:  A HERS II rater, 3 years experience in MF buildings, GPR EH MF Rater, CEPE (res or non res)"]
[null,null,null,null,"Recommended questions for building owner to ask auditor:\n1.  How many buildings have you audited?\n2.  How many buildings like mine?\n3.  What are typical savings that you find/predict?\n4.  How much of the recommended work is typically acted on?\n5.  Can I see three sample reports from your previous jobs?\n6.  Can I have three references?"]
[null,"Third-Party Verification ","HERS II Rater","N/A"]
[null,"Commissioning and retrocommissioning (required for some HR measures; good practice for some others)","Commissioning - Meet requirements of BIG or Cal Green (*see below)\nhttp://www.documents.dgs.ca.gov/bsc/CALGreen/Non-Res-Comm-Guide-10-10.pdf, OR                                                                                                                                   Person or Firm doing the commissioning must be on the approved list with the California Commissioning Collaborative <http://www.cacx.org/resources/selecting.html>   The Cx agent does not have to be an independent third party.","Commissioning or Retro Commissioing Certification from one of the following certifying bodies:  Association of Energy Engineers, AABC Commissioning Group, ASHRAE, National Environmental Balancing Bureau, Testing Adjusting and Balancing Bureau or University of Wisconsin-Madison","See California Commissioning Collaborative's \"How to Select a Cx Provider\"\nhttp://www.cacx.org/resources/selecting.html"]
[null,"Combustion appliance safety","BPI Building Analyst  or HERS Building Performance Contractor","N/A","N/A"]
[null,"Feasibility of renewable energy installation","CSI Approved Contractor (C-46 Solar Contractor license)","N/A","N/A"]
[null,"Renewable energy inspection/verification","HERS Rater with PV qualification from HERS Provider","N/A","N/A"]
[null,"Operations and maintenance","BPI Multifamily Building Operator or NAHMA Green Building Operator","N/A","N/A"]
[null,"CUAC Analysis"," California Association of Building Energy Consultants (CABEC) Certified Energy Plans Examiner (CEPE), AND either HERS Rater or CA Licensed Engineer","N/A","N/A"]
[null,"Green Point Rating","Build It Green Certified Multifamily Green Point Rater","N/A","N/A"]
[null,"CalGreen Compliance","HERS II or Multifamily Green Point Rater","N/A","N/A"]
{"$rows_left_out":30}
{"sheet":"NC Verification Quals","index":8,"n_rows":13,"n_cols":4,"rows_kept":13,"cut":false,"hidden":false,"merged":[[3,1,4,1],[5,1,12,1]]}
[]
[null,"Verification Team Profesisional Qualifications for New Construction"]
[null,"Applicability","Task","Minimum Qualification"]
[null,"Required for all Multifamily Projects","Energy Modeling","California Association of Building Energy Consultants (CABEC) Certified Energy Plans Examiner (CEPE) (Nonres CEPE for high-rise MF and Res CEPE for low-rise MF). The consultant preparing the \"as-built\" energy model shall be responsible for verifying that all the energy efficiency measures have been met, including verification of installation certificates (CF-6R forms) and field verification certificates (CF-4R forms) for Low-rise and required acceptance testing forms for High-rise"]
[null,null,"Verification","HERS Rater "]
[null,"Required depending on scope","HVAC system efficiency and balancing (including duct testing)","California Field Verification and Diagnostic Testing Rater (one level of HERS Rater)"]
[null,null,"Central domestic water heating and distribution system efficiency","C-36 plumbing or C-4 boiler contractor license for renovation recommendations and all installation, and HERS Rater for verification"]
[null,null,"Commissioning (required for some HR measures; good practice for many others)","Trained Contractor, Commissioning Agent accredited through CEC approved program."]
[null,null,"Water, IAQ and resources measures","GreenPoint Rated Multifamily Rater "]
[null,null,"Combustion appliance safety","BPI Analyst"]
[null,null,"Renewable energy installation","CSI Approved Contractor (C-46 Solar Contractor license)"]
[null,null,"Renewable energy inspection/verification","HERS Rater with PV qualification from HERS Provider"]
[null,null,"Operations and maintenance","BPI Multifamily Building Operator or NAHMA Green Building Operator"]